RK3308BS

固件类型:自行编译的固件
SDK包名称:RK3308_Linux_SDK_V1.5.2
SDK修改内容:3308BS
Log日志:dmesg.txt

ubuntu16.04-桌面系统,阿里云镜像站下载
1、uboot和Kernel可以编译成功
2、编译buildroot时,source buildroot/build/envsetup.sh
选26. rockchip_rk3308_bs_release
3、编译报错如下
Makefile:2500: recipe for target ‘all-recursive’ failed
make[5]: *** [all-recursive] Error 1
Makefile:1223: recipe for target ‘all’ failed
make[4]: *** [all] Error 2
Makefile:1273: recipe for target ‘all-recursive’ failed
make[3]: *** [all-recursive] Error 1
Makefile:894: recipe for target ‘all’ failed
make[2]: *** [all] Error 2
package/pkg-generic.mk:247: recipe for target ‘/home/ubuntu/gxy/rk3308/rk3308/buildroot/output/rockchip_rk3308_bs_release/build/host-libglib2-2.54.2/.stamp_built’ failed
make[1]: *** [/home/ubuntu/gxy/rk3308/rk3308/buildroot/output/rockchip_rk3308_bs_release/build/host-libglib2-2.54.2/.stamp_built] Error 2
/home/ubuntu/gxy/rk3308/rk3308/buildroot/output/rockchip_rk3308_bs_release/Makefile:16: recipe for target ‘_all’ failed

tchip_askquestions
dmesg.txt (26.6 KB)

请问问题解决了吗?如何解决的