- 主机:ubuntu16.04 64位
- 编译对象: firefly-rk3288-lollipop
- 错误现象如下:
libnativehelper/JniConstants.cpp:135: error: unsupported reloc 43
libnativehelper/JniConstants.cpp:136: error: unsupported reloc 43
libnativehelper/JniConstants.cpp:137: error: unsupported reloc 43
libnativehelper/JniConstants.cpp:138: error: unsupported reloc 43
libnativehelper/JniConstants.cpp:139: error: unsupported reloc 43
libnativehelper/JniConstants.cpp:140: error: unsupported reloc 43
libnativehelper/toStringArray.cpp:21: error: unsupported reloc 43
libnativehelper/toStringArray.cpp:21: error: unsupported reloc 43
libnativehelper/JniInvocation.cpp:40: error: unsupported reloc 43
libnativehelper/JniInvocation.cpp:45: error: unsupported reloc 43
libnativehelper/JniInvocation.cpp:165: error: unsupported reloc 43
libnativehelper/JniInvocation.cpp:165: error: unsupported reloc 43
libnativehelper/JniInvocation.cpp:165: error: unsupported reloc 43
libnativehelper/JniInvocation.cpp:165: error: unsupported reloc 43
clang: error: linker command failed with exit code 1 (use -v to see invocation)
build/core/host_shared_library_internal.mk:44: recipe for target ‘out/host/linux-x86/obj32/lib/libnativehelper.so’ failed
make: *** [out/host/linux-x86/obj32/lib/libnativehelper.so] Error 1
make: *** 正在等待未完成的任务…
#### make failed to build some targets (45:38 (mm:ss)) ####