user24
1
本帖最后由 wico 于 2018-11-16 19:46 编辑
ROC-Rk3308-CC 代码主要更新:
-
Buildroot更新:
-
使用devtmpfs+eudev作为/dev设备管理。
-
使用USBMOUNT软件包作为U盘挂载程序。
-
修复OEM分区镜像概率打包异常问题。
-
更新partinit软件包,完善分区挂载机制。
-
修复概率ADB设备识别不到问题。
-
更新DuerClientSDK至20180928版本
-
更新思必驰新版本语音算法。
-
新增 Amazon 官方 AVS C++ SDK
-
Kernel更新:
-
提升CPU高频状态下UART功能稳定
-
提升系统稳定性。
-
工具更新:
-
更新AndroidTool
-
更新Linux_Upgrade_Tool
-
新增APK:duerhome_shell-debug.apk
WIKI更新:针对最新的SDK,WIKI内容进行了更新,访问时如果没有更新,请刷新页面,地址:http://wiki.t-firefly.com/ROC-RK3308-CC/intro.html
SDK .git压缩包更新:Firefly-RK3308_Linux_SDK_git_20181116.7z
固件更新:最新参考固件已可以在官网下载,固件更新日期:20181114
源码更新提示:可通过上面的.git压缩包下载源码,也可通过下面来更新源码:
编译提示:由于更新内容过多,更新完后先清除旧版本的output/,再进行编译,执行:
rm buildroot/output -rf
./build.sh
官方网站:http://www.t-firefly.com
维基教程:http://wiki.t-firefly.com
开发者社区:http://developer.t-firefly.com
购买链接:https://t-firefly.taobao.com/
技术交流群(QQ):431139193 | 586343230
微信公众号:Firefly开源团队
libtool: link: (cd “.libs” && rm -f “libitm.so” && ln -s “libitm.so.1.0.0” “libitm.so”)
libtool: link: /home/xxdk/prj/Firefly-RK3308/buildroot/output/firefly_rk3308_release/host/aarch64-rockchip-linux-gnu/bin/ar rc .libs/libitm.a aatree.o alloc.o alloc_c.o alloc_cpp.o barrier.o beginend.o clone.o eh_cpp.o local.o query.o retry.o rwlock.o useraction.o util.o sjlj.o tls.o method-serial.o method-gl.o method-ml.o futex.o
libtool: link: /home/xxdk/prj/Firefly-RK3308/buildroot/output/firefly_rk3308_release/host/aarch64-rockchip-linux-gnu/bin/ranlib .libs/libitm.a
libtool: link: ( cd “.libs” && rm -f “libitm.la” && ln -s “../libitm.la” “libitm.la” )
make[6]: write error: stdout
Makefile:723: recipe for target ‘all-recursive’ failed
make[5]: *** [all-recursive] Error 1
Makefile:388: recipe for target ‘all’ failed
make[4]: *** [all] Error 2
Makefile:13971: recipe for target ‘all-target-libitm’ failed
make[3]: *** [all-target-libitm] Error 2
make[3]: *** Waiting for unfinished jobs…
config.status: executing libtool commands
config.status: executing gstdint.h commands
Makefile:878: recipe for target ‘all’ failed
make[2]: *** [all] Error 2
package/pkg-generic.mk:247: recipe for target ‘/home/xxdk/prj/Firefly-RK3308/buildroot/output/firefly_rk3308_release/build/host-gcc-final-6.4.0/.stamp_built’ failed
make[1]: *** [/home/xxdk/prj/Firefly-RK3308/buildroot/output/firefly_rk3308_release/build/host-gcc-final-6.4.0/.stamp_built] Error 2
/home/xxdk/prj/Firefly-RK3308/buildroot/output/firefly_rk3308_release/Makefile:16: recipe for target ‘_all’ failed
make: *** [_all] Error 2
Command exited with non-zero status 1
you take 27:13.78 to build builroot
====Build buildroot failed!====
不知道怎么解决 请各位大神指点
一编译 RK3308 dueros打包的时候 出错。科大讯飞是OK的。
Buildroot 编译到host-python 2.7.14出现错误
host-python-2.7.14 ./python -E -S -m sysconfig --generate-posix-vars ;
if test $? -ne 0 ; then
echo “generate-posix-vars failed” ;
rm -f ./pybuilddir.txt ;
exit 1 ;
fi
Segmentation fault (core dumped)
generate-posix-vars failed
make[2]: *** [Makefile:516:pybuilddir.txt] 错误 1
遇到过吗!