编译buildroot出错

g yes
2021-04-12T20:03:54 checking whether mbrtowc works on empty input… yes
2021-04-12T20:03:54 checking whether mbrtowc handles incomplete characters… (cached) guessing yes
2021-04-12T20:03:54 checking whether mbrtowc works as well as mbtowc… (cached) guessing yes
2021-04-12T20:03:54 checking whether mbrtowc handles incomplete characters… (cached) guessing yes
2021-04-12T20:03:54 checking whether mbrtowc works as well as mbtowc… (cached) guessing yes
2021-04-12T20:03:54 checking whether mbsrtowcs works… guessing yes
2021-04-12T20:03:54 checking for mempcpy… (cached) yes
2021-04-12T20:03:54 checking for memrchr… yes
2021-04-12T20:03:54 checking whether mkdir handles trailing slash… yes
2021-04-12T20:03:54 checking whether mkdir handles trailing dot… yes
2021-04-12T20:03:54 checking for mkdtemp… yes
2021-04-12T20:03:54 checking whether mkfifo rejects trailing slashes… yes
2021-04-12T20:03:54 checking whether mknod can create fifo without root privileges… configure: error: in /home/wzp/nfs/rk312x_linux_beta_v0.1_200513/buildroot/output/rockchip_rk3288/build/host-tar-1.29': 2021-04-12T20:03:54 configure: error: you should not run configure as root (set FORCE_UNSAFE_CONFIGURE=1 in environment to bypass this check) 2021-04-12T20:03:54 See config.log’ for more details
2021-04-12T20:03:55 make[1]: *** [package/pkg-generic.mk:247:/home/wzp/nfs/rk312x_linux_beta_v0.1_200513/buildroot/output/rockchip_rk3288/build/host-tar-1.29/.stamp_configured] 错误 1
2021-04-12T20:03:55 make: *** [/home/wzp/nfs/rk312x_linux_beta_v0.1_200513/buildroot/output/rockchip_rk3288/Makefile:16:_all] 错误 2
Command exited with non-zero status 1
you take 0:25.71 to build builroot
====Build buildroot failed!====